BDBM50561051 CHEMBL4749434
SMILES C[C@H](N)C(=O)N1C[C@@H](CCB(O)O)C[C@@](N)([C@@H]1C)C(O)=O
InChI Key InChIKey=MHNMIXAVOLTFGT-PHGLEFOZSA-N
Data  2 IC50
  Tab Delimited (TSV)   2D SDfile   Computed 3D by Vconf -m prep SDfile
Find this compound or compounds like it in BindingDB:
Activity Spreadsheet -- Enzyme Inhibition Constant Data from BindingDB
Found 2 hits for monomerid = 50561051
TargetArginase-2, mitochondrial(Homo sapiens (Human))
Oncoarendi Therapeutics
Curated by ChEMBL
LigandPNGBDBM50561051(CHEMBL4749434)
Affinity DataIC50:  500nM. Assay description: Inhibition of human Arg2
Ligand InfoPC cidPC sid
In DepthDetails ArticlePubMed
TargetArginase-1(Homo sapiens (Human))
Oncoarendi Therapeutics
Curated by ChEMBL
LigandPNGBDBM50561051(CHEMBL4749434)
Affinity DataIC50:  1nM. Assay description: Inhibition of human Arg1
Ligand InfoPC cidPC sid
In DepthDetails ArticlePubMed