BDBM50561892 CHEMBL4795486
SMILES O[C@@H]1[C@@H](COP(O)(=O)CP(O)(O)=O)O[C@H]([C@@H]1O)n1cnc2c(NCc3ccc(cc3)C(=O)NCCCCCCNC(=O)c3ccc4C(=O)OC5(c4c3)c3ccc(O)cc3Oc3cc(O)ccc53)ncnc12
InChI Key InChIKey=HSTHOARJPZGBSI-PNQPYDHWSA-N
Data  3 KI
  Tab Delimited (TSV)   2D SDfile   Computed 3D by Vconf -m prep SDfile
Find this compound or compounds like it in BindingDB:
Activity Spreadsheet -- Enzyme Inhibition Constant Data from BindingDB
Found 3 hits for monomerid = 50561892
Target5'-nucleotidase(Homo sapiens (Human))
University Of Bonn
Curated by ChEMBL
LigandPNGBDBM50561892(CHEMBL4795486)
Affinity DataKi:  3nM. Assay description: Inhibition of recombinant human C-terminal His-tagged CD73 (27 to 549 residues) expressed in Sf9 cells using [2,8-3H]-AMP as substrate incubated for ...
Ligand InfoPC cidPC sid
In DepthDetails ArticlePubMed
Target5'-nucleotidase(Homo sapiens (Human))
University Of Bonn
Curated by ChEMBL
LigandPNGBDBM50561892(CHEMBL4795486)
Affinity DataKi:  4.60nM. Assay description: Inhibition of CD73 in human MDA-MB-231 cells using [2,8-3H]-AMP as substrate incubated for 25 mins by scintillation counting method
Ligand InfoPC cidPC sid
In DepthDetails ArticlePubMed
Target5'-nucleotidase(Rattus norvegicus (Rat))
University Of Bonn
Curated by ChEMBL
LigandPNGBDBM50561892(CHEMBL4795486)
Affinity DataKi:  26nM. Assay description: Inhibition of recombinant rat CD73 expressed in Sf9 cells using [2,8-3H]-AMP as substrate incubated for 25 mins by scintillation counting method
Ligand InfoPC cidPC sid
In DepthDetails ArticlePubMed