BDBM50563885 CHEMBL4796629
SMILES Oc1nc(ncc1C(=O)NCc1ccc(cc1)-c1ccccc1)-n1cccn1
InChI Key InChIKey=QAKRFBVXEOZHSZ-UHFFFAOYSA-N
Data  1 IC50
  Tab Delimited (TSV)   2D SDfile   Computed 3D by Vconf -m prep SDfile
Find this compound or compounds like it in BindingDB:
Activity Spreadsheet -- Enzyme Inhibition Constant Data from BindingDB
Found 1 hit for monomerid = 50563885
TargetEgl nine homolog 1(Homo sapiens (Human))
Merck Research Laboratories
Curated by ChEMBL
LigandPNGBDBM50563885(CHEMBL4796629)
Affinity DataIC50:  1.30nM. Assay description: Inhibition of FLAG-tagged full-length HIF-PHD2 (unknown origin) expressed in baculovirus infected Sf9 cells using 2-oxoglutarate and HIF1alpha biotin...
Ligand InfoPC cidPC sid
In DepthDetails ArticlePubMed