BDBM50563887 CHEMBL4785918
SMILES COc1ccc(cc1)C(NC(=O)c1cnc(nc1O)-n1cccn1)c1ccc(OC)cc1
InChI Key InChIKey=USZAFFTYZMCNKA-UHFFFAOYSA-N
Data  2 IC50
  Tab Delimited (TSV)   2D SDfile   Computed 3D by Vconf -m prep SDfile
Find this compound or compounds like it in BindingDB:
Activity Spreadsheet -- Enzyme Inhibition Constant Data from BindingDB
Found 2 hits for monomerid = 50563887
TargetPotassium voltage-gated channel subfamily H member 2(Homo sapiens (Human))
Merck Research Laboratories
Curated by ChEMBL
LigandPNGBDBM50563887(CHEMBL4785918)
Affinity DataIC50:  900nM. Assay description: Inhibition of human ERG
Ligand InfoPC cidPC sid
In DepthDetails ArticlePubMed
TargetEgl nine homolog 1(Homo sapiens (Human))
Merck Research Laboratories
Curated by ChEMBL
LigandPNGBDBM50563887(CHEMBL4785918)
Affinity DataIC50:  1.10nM. Assay description: Inhibition of FLAG-tagged full-length HIF-PHD2 (unknown origin) expressed in baculovirus infected Sf9 cells using 2-oxoglutarate and HIF1alpha biotin...
Ligand InfoPC cidPC sid
In DepthDetails ArticlePubMed