BDBM50565846 CHEMBL4796315
SMILES CSCC[C@H](NC(=O)[C@@H](NC(=O)[C@H](CC(C)C)NC(=O)[C@H](CC(N)=O)NC(=O)[C@@H](NC(=O)[C@@H]1CCCN1C(=O)[C@H](CCCNC(N)=N)NC(=O)[C@@H]1CCC(=O)N1)C(C)C)[C@@H](C)O)C(=O)N[C@@H](C)C(=O)N[C@@H](CCCNC(N)=N)C(=O)N[C@@H](CCCCN)C(=O)N[C@@H](CC(C)C)C(=O)N[C@@H](CCCNC(N)=N)C(=O)N[C@@H](CCCCN)C(=O)N[C@@H](Cc1cnc[nH]1)C(=O)N[C@@H](CC(N)=O)C(=O)N[C@H]1CSSC[C@H](NC(=O)[C@H](CCCNC(N)=N)NC(=O)[C@H](CCCNC(N)=N)NC(=O)[C@H](CCC(N)=O)NC(=O)[C@H](CC(C)C)NC1=O)C(=O)N[C@@H](CCSC)C(=O)N1CCC[C@H]1C(=O)N[C@@H](CC(C)C)C(=O)N[C@@H](Cc1cnc[nH]1)C(=O)N[C@@H](CO)C(=O)N[C@@H](CCCNC(N)=N)C(=O)N[C@@H](C(C)C)C(=O)N1CCC[C@H]1C(=O)N[C@@H](Cc1ccccc1)C(=O)N1CCC[C@H]1C(O)=O
InChI Key
Data  1 KI  3 EC50
  Tab Delimited (TSV)   2D SDfile   Computed 3D by Vconf -m prep SDfile
Find this compound or compounds like it in BindingDB:
Activity Spreadsheet -- Enzyme Inhibition Constant Data from BindingDB
Found 4 hits for monomerid = 50565846
TargetApelin receptor(Homo sapiens (Human))
Universit£
Curated by ChEMBL
LigandPNGBDBM50565846(CHEMBL4796315)
Affinity DataKi:  0.190nM. Assay description: Displacement of [125I] [NIe75, Tyr77]Pyr-apelin-13 from YFP-tagged human APJ receptor expressed in HEK293 cell membranes incubated for 1 hr by gamma ...
Ligand InfoPC cidPC sid
In DepthDetails ArticlePubMed
TargetApelin receptor(Homo sapiens (Human))
Universit£
Curated by ChEMBL
LigandPNGBDBM50565846(CHEMBL4796315)
Affinity DataEC50:  5.30nM. Assay description: Agonist activity at human APJ receptor expressed in HEK293 cells co-expressing Galpha(i1)-RlucII(91) assessed as induction of dissociation of Galpha(...
Ligand InfoPC cidPC sid
In DepthDetails ArticlePubMed
TargetApelin receptor(Homo sapiens (Human))
Universit£
Curated by ChEMBL
LigandPNGBDBM50565846(CHEMBL4796315)
Affinity DataEC50:  25nM. Assay description: Agonist activity at human APJ receptor expressed in HEK293T cells co-expressing PDZ-Rho-Gef-RLucll assessed as induction of Galpha12 effector (PDZ-Rh...
Ligand InfoPC cidPC sid
In DepthDetails ArticlePubMed
TargetApelin receptor(Homo sapiens (Human))
Universit£
Curated by ChEMBL
LigandPNGBDBM50565846(CHEMBL4796315)
Affinity DataEC50:  45nM. Assay description: Agonist activity at human APJ receptor expressed in HEK293 cells co-expressing Rlucll-beta-arrestin2 assessed as induction of beta-arrestin2 recruitm...
Ligand InfoPC cidPC sid
In DepthDetails ArticlePubMed