BDBM50566290 CHEMBL4857851
SMILES CCCC[C@H](NC(=O)[C@@H]1CCCN1C(=O)CNC(=O)[C@H](CCCCN)NC(=O)[C@H](Cc1cnc[nH]1)NC(=O)[C@H](CO)NC(=O)[C@H](CC(C)C)NC(=O)[C@H](CCCNC(N)=N)NC(=O)[C@@H]1CCCN1C(=O)[C@H](CCCNC(N)=N)NC(=O)[C@@H]1CCC(=O)N1)C(=O)N1CCC[C@H]1C(=O)N1Cc2cc(OCc3ccccc3)ccc2C[C@@H]1C(O)=O
InChI Key
Data  1 KI  3 EC50
  Tab Delimited (TSV)   2D SDfile   Computed 3D by Vconf -m prep SDfile
Find this compound or compounds like it in BindingDB:
Activity Spreadsheet -- Enzyme Inhibition Constant Data from BindingDB
Found 4 hits for monomerid = 50566290
TargetApelin receptor(Homo sapiens (Human))
Universit£
Curated by ChEMBL
LigandPNGBDBM50566290(CHEMBL4857851)
Affinity DataKi:  0.190nM. Assay description: Displacement of [125I] [NIe75,Tyr77]Pyr-apelin-13 from YFP-tagged human APJ receptor expressed in HEK293 cells incubated for 1 hr by gamma counting a...
Ligand InfoPC cidPC sid
In DepthDetails ArticlePubMed
TargetApelin receptor(Homo sapiens (Human))
Universit£
Curated by ChEMBL
LigandPNGBDBM50566290(CHEMBL4857851)
Affinity DataEC50:  45nM. Assay description: Agonist activity at human APJ receptor expressed in HEK293 cells co-expressing Rlucll-beta-arrestin2 assessed as induction of beta-arrestin2 recruitm...
Ligand InfoPC cidPC sid
In DepthDetails ArticlePubMed
TargetApelin receptor(Homo sapiens (Human))
Universit£
Curated by ChEMBL
LigandPNGBDBM50566290(CHEMBL4857851)
Affinity DataEC50:  3.40nM. Assay description: Agonist activity at human APJ receptor expressed in HEK293T cells co-expressing Galphai1 RlucII assessed as dissociation of Galphai1 from Gbetta/gamm...
Ligand InfoPC cidPC sid
In DepthDetails ArticlePubMed
TargetApelin receptor(Homo sapiens (Human))
Universit£
Curated by ChEMBL
LigandPNGBDBM50566290(CHEMBL4857851)
Affinity DataEC50:  22nM. Assay description: Agonist activity at human APJ receptor expressed in HEK293T cells co-expressing PDZ-Rho-Gef-RLucll and rGFP-CAAX assessed as induction of recruitment...
Ligand InfoPC cidPC sid
In DepthDetails ArticlePubMed