BDBM50567159 CHEMBL4874447
SMILES CCCCc1nc(=O)c(c(O)n1-c1c(OC)cccc1OC)S(=O)(=O)c1ccc(cc1)-c1ccc(F)cc1
InChI Key InChIKey=LKSINAJGXXUDMA-UHFFFAOYSA-N
Data  3 EC50
  Tab Delimited (TSV)   2D SDfile   Computed 3D by Vconf -m prep SDfile
Find this compound or compounds like it in BindingDB:
Activity Spreadsheet -- Enzyme Inhibition Constant Data from BindingDB
Found 3 hits for monomerid = 50567159
TargetApelin receptor(Homo sapiens (Human))
Bristol-Myers Squibb
Curated by ChEMBL
LigandPNGBDBM50567159(CHEMBL4874447)
Affinity DataEC50:  0.0800nM. Assay description: Agonist activity at human APJ receptor assessed as effect on cAMP accumulation by cAMP-Glo assay
Ligand InfoPC cidPC sid
In DepthDetails ArticlePubMed
TargetApelin receptor(Mus musculus)
Bristol-Myers Squibb
Curated by ChEMBL
LigandPNGBDBM50567159(CHEMBL4874447)
Affinity DataEC50:  0.100nM. Assay description: Agonist activity at mouse APJ receptor assessed as effect on cAMP accumulation by cAMP-Glo assay
Ligand InfoPC cidPC sid
In DepthDetails ArticlePubMed
TargetApelin receptor(Rattus norvegicus)
Bristol-Myers Squibb
Curated by ChEMBL
LigandPNGBDBM50567159(CHEMBL4874447)
Affinity DataEC50:  0.0200nM. Assay description: Agonist activity at rat APJ receptor assessed as effect on cAMP accumulation by cAMP-Glo assay
Ligand InfoPC cidPC sid
In DepthDetails ArticlePubMed