BDBM50568146 CHEMBL1481541
SMILES COc1ccccc1-c1nnc(SCC(=O)Nc2ccccc2)o1
InChI Key InChIKey=WRONCDXHQCNSOW-UHFFFAOYSA-N
Data  1 KI  1 IC50
  Tab Delimited (TSV)   2D SDfile   Computed 3D by Vconf -m prep SDfile
Find this compound or compounds like it in BindingDB:
Activity Spreadsheet -- Enzyme Inhibition Constant Data from BindingDB
Found 2 hits for monomerid = 50568146
TargetPolyphenol oxidase 2(Agaricus bisporus (Common mushroom))
Kongju National University
Curated by ChEMBL
LigandPNGBDBM50568146(CHEMBL1481541)
Affinity DataKi:  3.10nM. Assay description: Noncompetitive inhibition of mushroom tyrosinase assessed as dissociation constant using L-DOPA as substrate by Lineweaver-Burk plot analysis
Ligand InfoPC cidPC sid
In DepthDetails ArticlePubMed
TargetPolyphenol oxidase 2(Agaricus bisporus (Common mushroom))
Kongju National University
Curated by ChEMBL
LigandPNGBDBM50568146(CHEMBL1481541)
Affinity DataIC50:  3nM. Assay description: Inhibition of mushroom tyrosinase using L-DOPA as substrate
Ligand InfoPC cidPC sid
In DepthDetails ArticlePubMed