BDBM50568150 CHEMBL4857732
SMILES COc1cccc(c1)-c1nnc(SCC(=O)Nc2ccccc2)o1
InChI Key InChIKey=MQGBXQMSTAKLMD-UHFFFAOYSA-N
Data  1 IC50
  Tab Delimited (TSV)   2D SDfile   Computed 3D by Vconf -m prep SDfile
Find this compound or compounds like it in BindingDB:
Activity Spreadsheet -- Enzyme Inhibition Constant Data from BindingDB
Found 1 hit for monomerid = 50568150
TargetPolyphenol oxidase 2(Agaricus bisporus (Common mushroom))
Kongju National University
Curated by ChEMBL
LigandPNGBDBM50568150(CHEMBL4857732)
Affinity DataIC50:  19nM. Assay description: Inhibition of mushroom tyrosinase using L-DOPA as substrate
Ligand InfoPC cidPC sid
In DepthDetails ArticlePubMed