BDBM50568223 CHEMBL4871000
SMILES COc1cc(ccc1OCC(=O)Nc1ccccc1)-c1cc(C(O)=O)c2ccccc2n1
InChI Key InChIKey=WNKBCVOESJQNPZ-UHFFFAOYSA-N
Data  1 IC50
  Tab Delimited (TSV)   2D SDfile   Computed 3D by Vconf -m prep SDfile
Find this compound or compounds like it in BindingDB:
Activity Spreadsheet -- Enzyme Inhibition Constant Data from BindingDB
Found 1 hit for monomerid = 50568223
TargetDihydroorotate dehydrogenase (quinone), mitochondrial(Homo sapiens (Human))
University Of Kragujevac
Curated by ChEMBL
LigandPNGBDBM50568223(CHEMBL4871000)
Affinity DataIC50:  3.90E+3nM. Assay description: Inhibition of human DHODH
Ligand InfoPC cidPC sid
In DepthDetails ArticlePubMed