BDBM50568235 CHEMBL4876717
SMILES COc1cc(ccc1OCC(=O)Nc1ccc(cc1)C(F)(F)F)-c1cc(C(O)=O)c2ccccc2n1
InChI Key InChIKey=HDOMUKMDSLYZQA-UHFFFAOYSA-N
Data  1 IC50
  Tab Delimited (TSV)   2D SDfile   Computed 3D by Vconf -m prep SDfile
Find this compound or compounds like it in BindingDB:
Activity Spreadsheet -- Enzyme Inhibition Constant Data from BindingDB
Found 1 hit for monomerid = 50568235
TargetDihydroorotate dehydrogenase (quinone), mitochondrial(Homo sapiens (Human))
University Of Kragujevac
Curated by ChEMBL
LigandPNGBDBM50568235(CHEMBL4876717)
Affinity DataIC50:  2.40E+3nM. Assay description: Inhibition of human DHODH
Ligand InfoPC cidPC sid
In DepthDetails ArticlePubMed