BDBM50568242 CHEMBL4874960
SMILES COc1cc(ccc1OCC(=O)NC12CC3CC(CC(C3)C1)C2)-c1cc(C(O)=O)c2ccccc2n1
InChI Key InChIKey=SYAVAWQKDQNJGR-UHFFFAOYSA-N
Data  1 IC50
  Tab Delimited (TSV)   2D SDfile   Computed 3D by Vconf -m prep SDfile
Find this compound or compounds like it in BindingDB:
Activity Spreadsheet -- Enzyme Inhibition Constant Data from BindingDB
Found 1 hit for monomerid = 50568242
TargetDihydroorotate dehydrogenase (quinone), mitochondrial(Homo sapiens (Human))
University Of Kragujevac
Curated by ChEMBL
LigandPNGBDBM50568242(CHEMBL4874960)
Affinity DataIC50:  1.70E+3nM. Assay description: Inhibition of human DHODH
Ligand InfoPC cidPC sid
In DepthDetails ArticlePubMed