BDBM50569510 CHEMBL4873588
SMILES CCOC(=O)c1ccc(NC(=O)N(C)Cc2ccncc2)cc1
InChI Key InChIKey=NVLXEJHFLFTLHY-UHFFFAOYSA-N
Data  1 EC50
  Tab Delimited (TSV)   2D SDfile   Computed 3D by Vconf -m prep SDfile
Find this compound or compounds like it in BindingDB:
Activity Spreadsheet -- Enzyme Inhibition Constant Data from BindingDB
Found 1 hit for monomerid = 50569510
TargetNicotinamide phosphoribosyltransferase(Homo sapiens (Human))
Sanford Burnham Prebys Medical Discovery Institute
Curated by ChEMBL
LigandPNGBDBM50569510(CHEMBL4873588)
Affinity DataEC50: >1.00E+5nM. Assay description: Activation of human NAMPT
Ligand InfoPC cidPC sid
In DepthDetails ArticlePubMed