BDBM50569514 CHEMBL1460701::US11452717, Compound TableB-3.16
SMILES CCOC(=O)c1ccc(NC(=O)NCc2ccccc2)cc1
InChI Key InChIKey=RWYJNVFPDNEYTI-UHFFFAOYSA-N
Data  2 EC50
  Tab Delimited (TSV)   2D SDfile   Computed 3D by Vconf -m prep SDfile
Find this compound or compounds like it in BindingDB:
Activity Spreadsheet -- Enzyme Inhibition Constant Data from BindingDB
Found 2 hits for monomerid = 50569514
TargetNicotinamide phosphoribosyltransferase(Homo sapiens (Human))
Sanford Burnham Prebys Medical Discovery Institute
US Patent
LigandPNGBDBM50569514(CHEMBL1460701 | US11452717, Compound TableB-3.16)
Affinity DataEC50: >2.00E+4nM. Assay description: NAMPT reaction was performed in 50 mM HEPES, pH 7.5, containing 5 mM MgCl2, 0.1% Prionex, 0.005% Tween 20, and 1 mM TCEP at room temperature in Grein...
Ligand InfoPC cidPC sid
In DepthDetails US Patent
TargetNicotinamide phosphoribosyltransferase(Homo sapiens (Human))
Sanford Burnham Prebys Medical Discovery Institute
US Patent
LigandPNGBDBM50569514(CHEMBL1460701 | US11452717, Compound TableB-3.16)
Affinity DataEC50:  1.37E+3nM. Assay description: Activation of human NAMPT
Ligand InfoPC cidPC sid
In DepthDetails ArticlePubMed