BDBM50569516 CHEMBL4868902
SMILES CCOC(=O)c1ccc(NC(=O)NCc2ccncn2)cc1
InChI Key InChIKey=WHCPFXZCRSIZGX-UHFFFAOYSA-N
Data  1 EC50
  Tab Delimited (TSV)   2D SDfile   Computed 3D by Vconf -m prep SDfile
Find this compound or compounds like it in BindingDB:
Activity Spreadsheet -- Enzyme Inhibition Constant Data from BindingDB
Found 1 hit for monomerid = 50569516
TargetNicotinamide phosphoribosyltransferase(Homo sapiens (Human))
Sanford Burnham Prebys Medical Discovery Institute
Curated by ChEMBL
LigandPNGBDBM50569516(CHEMBL4868902)
Affinity DataEC50:  1.36E+4nM. Assay description: Activation of human NAMPT
Ligand InfoPC cidPC sid
In DepthDetails ArticlePubMed