BDBM50569532 CHEMBL4848112::US11452717, Compound TableB-2.191
SMILES O=C(NCc1ccncc1)Nc1ccc(cc1)S(=O)(=O)N1CCc2ccccc2C1
InChI Key InChIKey=BVZCLFOPVBHYDL-UHFFFAOYSA-N
Data  2 EC50
  Tab Delimited (TSV)   2D SDfile   Computed 3D by Vconf -m prep SDfile
Find this compound or compounds like it in BindingDB:
Activity Spreadsheet -- Enzyme Inhibition Constant Data from BindingDB
Found 2 hits for monomerid = 50569532
TargetNicotinamide phosphoribosyltransferase(Homo sapiens (Human))
Sanford Burnham Prebys Medical Discovery Institute
US Patent
LigandPNGBDBM50569532(CHEMBL4848112 | US11452717, Compound TableB-2.191)
Affinity DataEC50:  1.05E+3nM. Assay description: NAMPT reaction was performed in 50 mM HEPES, pH 7.5, containing 5 mM MgCl2, 0.1% Prionex, 0.005% Tween 20, and 1 mM TCEP at room temperature in Grein...
Ligand InfoPC cidPC sid
In DepthDetails US Patent
TargetNicotinamide phosphoribosyltransferase(Homo sapiens (Human))
Sanford Burnham Prebys Medical Discovery Institute
US Patent
LigandPNGBDBM50569532(CHEMBL4848112 | US11452717, Compound TableB-2.191)
Affinity DataEC50:  142nM. Assay description: Activation of human NAMPT
Ligand InfoPC cidPC sid
In DepthDetails ArticlePubMed