BDBM50569535 CHEMBL4856434::US11452717, Compound TableB-2.221
SMILES Clc1ccccc1S(=O)(=O)c1ccc(NC(=O)NCc2ccncc2)cc1
InChI Key InChIKey=SYUFOLLUZULGAV-UHFFFAOYSA-N
Data  2 EC50
  Tab Delimited (TSV)   2D SDfile   Computed 3D by Vconf -m prep SDfile
Find this compound or compounds like it in BindingDB:
Activity Spreadsheet -- Enzyme Inhibition Constant Data from BindingDB
Found 2 hits for monomerid = 50569535
TargetNicotinamide phosphoribosyltransferase(Homo sapiens (Human))
Sanford Burnham Prebys Medical Discovery Institute
US Patent
LigandPNGBDBM50569535(CHEMBL4856434 | US11452717, Compound TableB-2.221)
Affinity DataEC50: <100nM. Assay description: NAMPT reaction was performed in 50 mM HEPES, pH 7.5, containing 5 mM MgCl2, 0.1% Prionex, 0.005% Tween 20, and 1 mM TCEP at room temperature in Grein...
Ligand InfoPC cidPC sid
In DepthDetails US Patent
TargetNicotinamide phosphoribosyltransferase(Homo sapiens (Human))
Sanford Burnham Prebys Medical Discovery Institute
US Patent
LigandPNGBDBM50569535(CHEMBL4856434 | US11452717, Compound TableB-2.221)
Affinity DataEC50:  79nM. Assay description: Activation of human NAMPT
Ligand InfoPC cidPC sid
In DepthDetails ArticlePubMed