BDBM50569952 CHEMBL4869028
SMILES CCCCCc1ccc(cc1)-c1cn(CCC[C@@H]2CO[C@H](COS(=O)(=O)NC(=O)[C@@H](N)CC(C)C)[C@@H](O)[C@H]2O)nn1
InChI Key InChIKey=APPGUXVTRIHQDP-GVPWJHIJSA-N
Data  1 KI
PDB links: 1 PDB ID matches this monomer.
  Tab Delimited (TSV)   2D SDfile   Computed 3D by Vconf -m prep SDfile
Find this compound or compounds like it in BindingDB:
Activity Spreadsheet -- Enzyme Inhibition Constant Data from BindingDB
Found 1 hit for monomerid = 50569952
TargetLeucine--tRNA ligase(Escherichia coli (strain K12))
Ku Leuven
Curated by ChEMBL
LigandPNGBDBM50569952(CHEMBL4869028)
Affinity DataKi:  5.5nM. Assay description: Inhibition of recombinant Escherichia coli LeuRS assessed as inhibition of 14C-radiolabelled leucine transfer to tRNA leucine preincubated for 10 min...
Ligand InfoPC cidPC sidPDB
In DepthDetails ArticlePubMed