BDBM50569957 CHEMBL4864965
SMILES CC(C)C[C@H](N)C(=O)NS(=O)(=O)OC[C@H]1OC[C@@H](CCCn2cc(nn2)-c2ccc(OC(F)(F)F)cc2)[C@H](O)[C@@H]1O
InChI Key InChIKey=RYNRVLDROIFGBF-RCUFNAHASA-N
Data  1 KI
PDB links: 1 PDB ID matches this monomer.
  Tab Delimited (TSV)   2D SDfile   Computed 3D by Vconf -m prep SDfile
Find this compound or compounds like it in BindingDB:
Activity Spreadsheet -- Enzyme Inhibition Constant Data from BindingDB
Found 1 hit for monomerid = 50569957
TargetLeucine--tRNA ligase(Escherichia coli (strain K12))
Ku Leuven
Curated by ChEMBL
LigandPNGBDBM50569957(CHEMBL4864965)
Affinity DataKi:  18nM. Assay description: Inhibition of recombinant Escherichia coli LeuRS assessed as inhibition of 14C-radiolabelled leucine transfer to tRNA leucine preincubated for 10 min...
Ligand InfoPC cidPC sidPDB
In DepthDetails ArticlePubMed