BDBM50570317 CHEMBL4863915
SMILES CNc1nc(C)c(s1)-c1nc(Nc2cc(C)cc(c2)N2CCOCC2)ncc1C#N
InChI Key InChIKey=ZIPADUJETRCYRU-UHFFFAOYSA-N
Data  2 KI
  Tab Delimited (TSV)   2D SDfile   Computed 3D by Vconf -m prep SDfile
Find this compound or compounds like it in BindingDB:
Activity Spreadsheet -- Enzyme Inhibition Constant Data from BindingDB
Found 2 hits for monomerid = 50570317
TargetCyclin-T1/Cyclin-dependent kinase 9(Homo sapiens (Human))
University Of Nottingham
Curated by ChEMBL
LigandPNGBDBM50570317(CHEMBL4863915)
Affinity DataKi:  5nM. Assay description: Inhibition of recombinant human full length CDK9/Cyclin T1 using KTFCGTPEYLAPEVRREPRILSEEEQEMFRDFDYIADWC as substrate incubated for 40 mins in presen...
Ligand InfoPC cidPC sid
In DepthDetails ArticlePubMed
TargetCyclin-A2/Cyclin-dependent kinase 2(Homo sapiens (Human))
University Of Nottingham
Curated by ChEMBL
LigandPNGBDBM50570317(CHEMBL4863915)
Affinity DataKi:  16nM. Assay description: Inhibition of recombinant human full length CDK2/Cyclin A using histone H1 as substrate incubated for 40 mins in presence of [gamma-33P]-ATP by scint...
Ligand InfoPC cidPC sid
In DepthDetails ArticlePubMed