BDBM50570439 CHEMBL4861311
SMILES Fc1ccc2c(noc2c1)C1CCN(CCCOc2ccc(CCN3CCCCC3)cc2)CC1
InChI Key InChIKey=WAIZFEIVFOBJJX-UHFFFAOYSA-N
Data  9 KI  1 IC50
  Tab Delimited (TSV)   2D SDfile   Computed 3D by Vconf -m prep SDfile
Find this compound or compounds like it in BindingDB:
Activity Spreadsheet -- Enzyme Inhibition Constant Data from BindingDB
Found 10 hits for monomerid = 50570439
Target5-hydroxytryptamine receptor 1A(Homo sapiens (Human))
Huazhong University Of Science And Technology
Curated by ChEMBL
LigandPNGBDBM50570439(CHEMBL4861311)
Affinity DataKi:  7.40nM. Assay description: Binding affinity to 5-HT1A receptor (unknown origin)
Ligand InfoPC cidPC sid
In DepthDetails ArticlePubMed
Target5-hydroxytryptamine receptor 2A(Homo sapiens (Human))
Huazhong University Of Science And Technology
Curated by ChEMBL
LigandPNGBDBM50570439(CHEMBL4861311)
Affinity DataKi:  9.40nM. Assay description: Binding affinity to 5-HT2A receptor (unknown origin)
Ligand InfoPC cidPC sid
In DepthDetails ArticlePubMed
TargetD(2) dopamine receptor(Homo sapiens (Human))
Huazhong University Of Science And Technology
Curated by ChEMBL
LigandPNGBDBM50570439(CHEMBL4861311)
Affinity DataKi:  9.70nM. Assay description: Binding affinity to dopamine D2 receptor (unknown origin)
Ligand InfoPC cidPC sid
In DepthDetails ArticlePubMed
TargetHistamine H3 receptor(Homo sapiens (Human))
Huazhong University Of Science And Technology
Curated by ChEMBL
LigandPNGBDBM50570439(CHEMBL4861311)
Affinity DataKi:  13nM. Assay description: Binding affinity to histamine H3 receptor (unknown origin)
Ligand InfoPC cidPC sid
In DepthDetails ArticlePubMed
TargetD(3) dopamine receptor(Homo sapiens)
Huazhong University Of Science And Technology
Curated by ChEMBL
LigandPNGBDBM50570439(CHEMBL4861311)
Affinity DataKi:  15nM. Assay description: Binding affinity to dopamine D3 receptor (unknown origin)
Ligand InfoPC cidPC sid
In DepthDetails ArticlePubMed
Target5-hydroxytryptamine receptor 6(Homo sapiens (Human))
Huazhong University Of Science And Technology
Curated by ChEMBL
LigandPNGBDBM50570439(CHEMBL4861311)
Affinity DataKi:  149nM. Assay description: Binding affinity to 5-HT6 receptor (unknown origin)
Ligand InfoPC cidPC sid
In DepthDetails ArticlePubMed
TargetAlpha-1A adrenergic receptor(Homo sapiens (Human))
Huazhong University Of Science And Technology
Curated by ChEMBL
LigandPNGBDBM50570439(CHEMBL4861311)
Affinity DataKi:  536nM. Assay description: Binding affinity to alpha1 adrenoceptor (unknown origin)
Ligand InfoPC cidPC sid
In DepthDetails ArticlePubMed
Target5-hydroxytryptamine receptor 2C(Homo sapiens)
Huazhong University Of Science And Technology
Curated by ChEMBL
LigandPNGBDBM50570439(CHEMBL4861311)
Affinity DataKi:  753nM. Assay description: Binding affinity to 5-HT2C receptor (unknown origin)
Ligand InfoPC cidPC sid
In DepthDetails ArticlePubMed
TargetHistamine H1 receptor(Homo sapiens (Human))
Huazhong University Of Science And Technology
Curated by ChEMBL
LigandPNGBDBM50570439(CHEMBL4861311)
Affinity DataKi:  1.02E+3nM. Assay description: Binding affinity to histamine H1 receptor (unknown origin)
Ligand InfoPC cidPC sid
In DepthDetails ArticlePubMed
TargetPotassium voltage-gated channel subfamily H member 2(Homo sapiens (Human))
Huazhong University Of Science And Technology
Curated by ChEMBL
LigandPNGBDBM50570439(CHEMBL4861311)
Affinity DataIC50:  2.29E+3nM. Assay description: Inhibition of human ERG by automated patch method relative to control
Ligand InfoPC cidPC sid
In DepthDetails ArticlePubMed