BDBM50570454 CHEMBL4846866
SMILES CN1CCN(Cc2ccc(OCCCCN3CCC(CC3)c3noc4cc(F)ccc34)cc2)CC1
InChI Key InChIKey=NZDANPPRKVYGPL-UHFFFAOYSA-N
Data  9 KI  1 IC50
  Tab Delimited (TSV)   2D SDfile   Computed 3D by Vconf -m prep SDfile
Find this compound or compounds like it in BindingDB:
Activity Spreadsheet -- Enzyme Inhibition Constant Data from BindingDB
Found 10 hits for monomerid = 50570454
TargetD(2) dopamine receptor(Homo sapiens (Human))
Huazhong University Of Science And Technology
Curated by ChEMBL
LigandPNGBDBM50570454(CHEMBL4846866)
Affinity DataKi:  1.90nM. Assay description: Binding affinity to dopamine D2 receptor (unknown origin)
Ligand InfoPC cidPC sid
In DepthDetails ArticlePubMed
Target5-hydroxytryptamine receptor 2A(Homo sapiens (Human))
Huazhong University Of Science And Technology
Curated by ChEMBL
LigandPNGBDBM50570454(CHEMBL4846866)
Affinity DataKi:  4.30nM. Assay description: Binding affinity to 5-HT2A receptor (unknown origin)
Ligand InfoPC cidPC sid
In DepthDetails ArticlePubMed
TargetHistamine H3 receptor(Homo sapiens (Human))
Huazhong University Of Science And Technology
Curated by ChEMBL
LigandPNGBDBM50570454(CHEMBL4846866)
Affinity DataKi:  9.20nM. Assay description: Binding affinity to histamine H3 receptor (unknown origin)
Ligand InfoPC cidPC sid
In DepthDetails ArticlePubMed
Target5-hydroxytryptamine receptor 1A(Homo sapiens (Human))
Huazhong University Of Science And Technology
Curated by ChEMBL
LigandPNGBDBM50570454(CHEMBL4846866)
Affinity DataKi:  12nM. Assay description: Binding affinity to 5-HT1A receptor (unknown origin)
Ligand InfoPC cidPC sid
In DepthDetails ArticlePubMed
TargetD(3) dopamine receptor(Homo sapiens)
Huazhong University Of Science And Technology
Curated by ChEMBL
LigandPNGBDBM50570454(CHEMBL4846866)
Affinity DataKi:  38nM. Assay description: Binding affinity to dopamine D3 receptor (unknown origin)
Ligand InfoPC cidPC sid
In DepthDetails ArticlePubMed
Target5-hydroxytryptamine receptor 6(Homo sapiens (Human))
Huazhong University Of Science And Technology
Curated by ChEMBL
LigandPNGBDBM50570454(CHEMBL4846866)
Affinity DataKi:  123nM. Assay description: Binding affinity to 5-HT6 receptor (unknown origin)
Ligand InfoPC cidPC sid
In DepthDetails ArticlePubMed
TargetAlpha-1A adrenergic receptor(Homo sapiens (Human))
Huazhong University Of Science And Technology
Curated by ChEMBL
LigandPNGBDBM50570454(CHEMBL4846866)
Affinity DataKi:  354nM. Assay description: Binding affinity to alpha1 adrenoceptor (unknown origin)
Ligand InfoPC cidPC sid
In DepthDetails ArticlePubMed
Target5-hydroxytryptamine receptor 2C(Homo sapiens)
Huazhong University Of Science And Technology
Curated by ChEMBL
LigandPNGBDBM50570454(CHEMBL4846866)
Affinity DataKi:  426nM. Assay description: Binding affinity to 5-HT2C receptor (unknown origin)
Ligand InfoPC cidPC sid
In DepthDetails ArticlePubMed
TargetHistamine H1 receptor(Homo sapiens (Human))
Huazhong University Of Science And Technology
Curated by ChEMBL
LigandPNGBDBM50570454(CHEMBL4846866)
Affinity DataKi:  642nM. Assay description: Binding affinity to histamine H1 receptor (unknown origin)
Ligand InfoPC cidPC sid
In DepthDetails ArticlePubMed
TargetPotassium voltage-gated channel subfamily H member 2(Homo sapiens (Human))
Huazhong University Of Science And Technology
Curated by ChEMBL
LigandPNGBDBM50570454(CHEMBL4846866)
Affinity DataIC50:  1.06E+3nM. Assay description: Inhibition of human ERG by automated patch method relative to control
Ligand InfoPC cidPC sid
In DepthDetails ArticlePubMed