BDBM50570953 CHEMBL4875875
SMILES CNC(=O)c1cc(cnc1N)-c1ccc(NC(=O)[C@H](O)c2cc(F)cc(F)c2)cc1C
InChI Key InChIKey=XMJPZNCMRRFABT-LJQANCHMSA-N
Data  2 IC50
  Tab Delimited (TSV)   2D SDfile   Computed 3D by Vconf -m prep SDfile
Find this compound or compounds like it in BindingDB:
Activity Spreadsheet -- Enzyme Inhibition Constant Data from BindingDB
Found 2 hits for monomerid = 50570953
TargetEukaryotic translation initiation factor 2 subunit 1(Homo sapiens)
Hibercell
Curated by ChEMBL
LigandPNGBDBM50570953(CHEMBL4875875)
Affinity DataIC50:  58nM. Assay description: Inhibition of eIF2alpha (unknown origin) assessed as eIF2alpha phosphorylation by TR-FRET assay
Ligand InfoPC cidPC sid
In DepthDetails ArticlePubMed
TargetEukaryotic translation initiation factor 2-alpha kinase 3(Homo sapiens (Human))
Hibercell
Curated by ChEMBL
LigandPNGBDBM50570953(CHEMBL4875875)
Affinity DataIC50:  14nM. Assay description: Inhibition of human His-tagged PERK expressed in Escherichia coli assessed as eIF2alpha phosphorylation by TR-FRET assay
Ligand InfoPC cidPC sid
In DepthDetails ArticlePubMed