BDBM50571385 CHEMBL4875417
SMILES Cl.COc1cccc(OC)c1-c1cc(nn1C1CCCC1)C(=O)N[C@@H](CCN1CCCCC1)CC(=O)NC1CCC1
InChI Key InChIKey=QRIQYJXARQJMMJ-BQAIUKQQSA-N
Data  1 KI  6 EC50
  Tab Delimited (TSV)   2D SDfile   Computed 3D by Vconf -m prep SDfile
Find this compound or compounds like it in BindingDB:
Activity Spreadsheet -- Enzyme Inhibition Constant Data from BindingDB
Found 7 hits for monomerid = 50571385
TargetApelin receptor(Homo sapiens (Human))
Rti International
Curated by ChEMBL
LigandPNGBDBM50571385(CHEMBL4875417)
Affinity DataKi:  90nM. Assay description: Binding affinity to human APJ assessed as inhibition constant
Ligand InfoPC cidPC sid
In DepthDetails ArticlePubMed
TargetApelin receptor(Homo sapiens (Human))
Rti International
Curated by ChEMBL
LigandPNGBDBM50571385(CHEMBL4875417)
Affinity DataEC50:  705nM. Assay description: Agonist activity at human AGTRL1 expressed in CHO-K1 cells assessed as induction of beta-arrestin 2 recruitment incubated for 90 mins by PathHunter a...
Ligand InfoPC cidPC sid
In DepthDetails ArticlePubMed
TargetApelin receptor(Homo sapiens (Human))
Rti International
Curated by ChEMBL
LigandPNGBDBM50571385(CHEMBL4875417)
Affinity DataEC50:  136nM. Assay description: Agonist activity at Galphaq16-fused human APJ receptor expressed in CHO cells assessed as stimulation of Ca2+ mobilization incubated for 1 hr by Calc...
Ligand InfoPC cidPC sid
In DepthDetails ArticlePubMed
TargetType-1 angiotensin II receptor(Homo sapiens (Human))
Rti International
Curated by ChEMBL
LigandPNGBDBM50571385(CHEMBL4875417)
Affinity DataEC50: >1.00E+4nM. Assay description: Agonist activity at Galphaq16-fused human AGTR1 expressed in CHO cells assessed as stimulation of Ca2+ mobilization incubated for 1 hr by Calcium 5-d...
Ligand InfoPC cidPC sid
In DepthDetails ArticlePubMed
TargetApelin receptor(Homo sapiens (Human))
Rti International
Curated by ChEMBL
LigandPNGBDBM50571385(CHEMBL4875417)
Affinity DataEC50:  483nM. Assay description: Agonist activity at human APJ receptor expressed in CHO-K1 cell membrane incubated for 60 mins under shaking condition in presence of [35S]GTPgammaS ...
Ligand InfoPC cidPC sid
In DepthDetails ArticlePubMed
TargetApelin receptor(Homo sapiens (Human))
Rti International
Curated by ChEMBL
LigandPNGBDBM50571385(CHEMBL4875417)
Affinity DataEC50:  162nM. Assay description: Agonist activity at human APJ receptor expressed in CHO cells assessed as inhibition of forskolin-induced cAMP accumulation measured after 40 mins by...
Ligand InfoPC cidPC sid
In DepthDetails ArticlePubMed
TargetApelin receptor(Mus musculus)
Rti International
Curated by ChEMBL
LigandPNGBDBM50571385(CHEMBL4875417)
Affinity DataEC50:  22nM. Assay description: Agonist activity at Galphaq16-fused mouse APJ receptor expressed in CHO cells assessed as stimulation of Ca2+ mobilization incubated for 1 hr by Calc...
Ligand InfoPC cidPC sid
In DepthDetails ArticlePubMed