BDBM50571505 CHEMBL4847763
SMILES CC(C)C[C@H](NC(=O)[C@@H](CC1CCCCC1)NC(=O)c1cnccn1)B(O)O
InChI Key InChIKey=JNOIFOLTDCGUJG-WBVHZDCISA-N
Data  2 IC50
  Tab Delimited (TSV)   2D SDfile   Computed 3D by Vconf -m prep SDfile
Find this compound or compounds like it in BindingDB:
Activity Spreadsheet -- Enzyme Inhibition Constant Data from BindingDB
Found 2 hits for monomerid = 50571505
TargetA5LHX3/O14818/P20618/P25786/P25787/P25788/P25789/P28062/P28065/P28066/P28070/P28072/P28074/P40306/P49720/P49721/P60900/Q8TAA3/Q99436(Homo sapiens (Human))
Genomics Institute Of The Novartis Research Foundation
Curated by ChEMBL
LigandPNGBDBM50571505(CHEMBL4847763)
Affinity DataIC50:  843nM. Assay description: Inhibition of human erythrocytes 20S proteasome using QXL520-YRGITCSGRQK(5-FAM)-NH2 fluorogenic peptide as substrate preincubated for 10 mins followe...
Ligand InfoPC cidPC sid
In DepthDetails ArticlePubMed
TargetLon protease homolog, mitochondrial(Homo sapiens)
Genomics Institute Of The Novartis Research Foundation
Curated by ChEMBL
LigandPNGBDBM50571505(CHEMBL4847763)
Affinity DataIC50:  137nM. Assay description: Inhibition of LONP1 (unknown origin) using QXL520-YRGITCSGRQK(5-FAM)-NH2 peptide as substrate incubated for 50 mins in presence of ATP by HTRF assay
Ligand InfoPC cidPC sid
In DepthDetails ArticlePubMed