BDBM50571508 CHEMBL4856768
SMILES CCCC[C@@H](NC(=O)c1cnccn1)C(=O)N[C@@H](CC(C)C)B(O)O
InChI Key InChIKey=UYJROBYUUYPCNR-OCCSQVGLSA-N
Data  2 IC50
  Tab Delimited (TSV)   2D SDfile   Computed 3D by Vconf -m prep SDfile
Find this compound or compounds like it in BindingDB:
Activity Spreadsheet -- Enzyme Inhibition Constant Data from BindingDB
Found 2 hits for monomerid = 50571508
TargetA5LHX3/O14818/P20618/P25786/P25787/P25788/P25789/P28062/P28065/P28066/P28070/P28072/P28074/P40306/P49720/P49721/P60900/Q8TAA3/Q99436(Homo sapiens (Human))
Genomics Institute Of The Novartis Research Foundation
Curated by ChEMBL
LigandPNGBDBM50571508(CHEMBL4856768)
Affinity DataIC50: >1.00E+4nM. Assay description: Inhibition of human erythrocytes 20S proteasome using QXL520-YRGITCSGRQK(5-FAM)-NH2 fluorogenic peptide as substrate preincubated for 10 mins followe...
In DepthDetails ArticlePubMed
TargetLon protease homolog, mitochondrial(Homo sapiens)
Genomics Institute Of The Novartis Research Foundation
Curated by ChEMBL
LigandPNGBDBM50571508(CHEMBL4856768)
Affinity DataIC50:  93nM. Assay description: Inhibition of LONP1 (unknown origin) using QXL520-YRGITCSGRQK(5-FAM)-NH2 peptide as substrate incubated for 50 mins in presence of ATP by HTRF assay
In DepthDetails ArticlePubMed