BDBM50571941 CHEMBL4846790
SMILES CC(C)n1cc(C(=O)Nc2ccc(Oc3ncnc4CN(CC(=O)N5CCN(C)CC5)CCc34)c(F)c2)c(=O)n(-c2ccc(F)cc2)c1=O
InChI Key InChIKey=PHYBXPXVBJFNTE-UHFFFAOYSA-N
Data  4 IC50
  Tab Delimited (TSV)   2D SDfile   Computed 3D by Vconf -m prep SDfile
Find this compound or compounds like it in BindingDB:
Activity Spreadsheet -- Enzyme Inhibition Constant Data from BindingDB
Found 4 hits for monomerid = 50571941
TargetTyrosine-protein kinase receptor UFO(Homo sapiens (Human))
Eisai
Curated by ChEMBL
LigandPNGBDBM50571941(CHEMBL4846790)
Affinity DataIC50:  9.5nM. Assay description: Inhibition of Axl (unknown origin) by cell free assay
Ligand InfoPC cidPC sid
In DepthDetails ArticlePubMed
TargetTyrosine-protein kinase Mer(Mus musculus)
Eisai
Curated by ChEMBL
LigandPNGBDBM50571941(CHEMBL4846790)
Affinity DataIC50:  370nM. Assay description: Inhibition of Mer in mouse BaF3 cells
Ligand InfoPC cidPC sid
In DepthDetails ArticlePubMed
TargetTyrosine-protein kinase receptor UFO(Mus musculus)
Eisai
Curated by ChEMBL
LigandPNGBDBM50571941(CHEMBL4846790)
Affinity DataIC50:  78nM. Assay description: Inhibition of Axl in mouse BaF3 cells
Ligand InfoPC cidPC sid
In DepthDetails ArticlePubMed
TargetTyrosine-protein kinase Mer(Homo sapiens (Human))
Eisai
Curated by ChEMBL
LigandPNGBDBM50571941(CHEMBL4846790)
Affinity DataIC50:  210nM. Assay description: Inhibition of Mer (unknown origin) by cell free assay
Ligand InfoPC cidPC sid
In DepthDetails ArticlePubMed