BDBM50571951 CHEMBL4864780
SMILES CN1CCC(CN2CCc3c(C2)ncnc3Oc2ccc(NC(=O)c3cn(CC4CCC4)c(=O)n(-c4ccc(F)cc4)c3=O)cc2F)CC1
InChI Key InChIKey=ZNORSSZINYHFFL-UHFFFAOYSA-N
Data  4 IC50
  Tab Delimited (TSV)   2D SDfile   Computed 3D by Vconf -m prep SDfile
Find this compound or compounds like it in BindingDB:
Activity Spreadsheet -- Enzyme Inhibition Constant Data from BindingDB
Found 4 hits for monomerid = 50571951
TargetTyrosine-protein kinase receptor UFO(Homo sapiens (Human))
Eisai
Curated by ChEMBL
LigandPNGBDBM50571951(CHEMBL4864780)
Affinity DataIC50:  2.40nM. Assay description: Inhibition of Axl (unknown origin) by cell free assay
Ligand InfoPC cidPC sid
In DepthDetails ArticlePubMed
TargetTyrosine-protein kinase Mer(Mus musculus)
Eisai
Curated by ChEMBL
LigandPNGBDBM50571951(CHEMBL4864780)
Affinity DataIC50:  130nM. Assay description: Inhibition of Mer in mouse BaF3 cells
Ligand InfoPC cidPC sid
In DepthDetails ArticlePubMed
TargetTyrosine-protein kinase receptor UFO(Mus musculus)
Eisai
Curated by ChEMBL
LigandPNGBDBM50571951(CHEMBL4864780)
Affinity DataIC50:  16nM. Assay description: Inhibition of Axl in mouse BaF3 cells
Ligand InfoPC cidPC sid
In DepthDetails ArticlePubMed
TargetTyrosine-protein kinase Mer(Homo sapiens (Human))
Eisai
Curated by ChEMBL
LigandPNGBDBM50571951(CHEMBL4864780)
Affinity DataIC50:  88nM. Assay description: Inhibition of Mer (unknown origin) by cell free assay
Ligand InfoPC cidPC sid
In DepthDetails ArticlePubMed