BDBM50571995 CHEMBL4872806
SMILES Clc1ncc(cc1NS(=O)(=O)c1ccccc1)-c1ccc2nncc(-c3ccccc3)c2c1
InChI Key InChIKey=BJBPWDJBVBZXBF-UHFFFAOYSA-N
Data  1 IC50
  Tab Delimited (TSV)   2D SDfile   Computed 3D by Vconf -m prep SDfile
Find this compound or compounds like it in BindingDB:
Activity Spreadsheet -- Enzyme Inhibition Constant Data from BindingDB
Found 1 hit for monomerid = 50571995
LigandPNGBDBM50571995(CHEMBL4872806)
Affinity DataIC50:  2.90nM. Assay description: Inhibition of PI3Kdelta (unknown origin)
Ligand InfoPC cidPC sid
In DepthDetails ArticlePubMed