BDBM50572048 CHEMBL4869466
SMILES COc1ccccc1-c1ccc(C[C@H](NC(=O)[C@H](Cc2c[nH]c3ccc(O)cc23)NC(=O)CCCN)C(=O)N[C@@H](CCCCNC(N)=N)C(N)=O)cc1
InChI Key
Data  1 Kd
  Tab Delimited (TSV)   2D SDfile   Computed 3D by Vconf -m prep SDfile
Find this compound or compounds like it in BindingDB:
Activity Spreadsheet -- Enzyme Inhibition Constant Data from BindingDB
Found 1 hit for monomerid = 50572048
TargetEphrin type-A receptor 4(Homo sapiens (Human))
University Of California
Curated by ChEMBL
LigandPNGBDBM50572048(CHEMBL4869466)
Affinity DataKd:  196nM. Assay description: Binding affinity to N-terminal His tagged EphA4 LBD (unknown origin) (29 to 209 residues) expressed in Rosetta-Gami B(DE3) cells by isothermal titrat...
Ligand InfoPC cidPC sid
In DepthDetails ArticlePubMed