BDBM50572058 CHEMBL4850403
SMILES NCCCC(=O)N[C@@H](Cc1c[nH]c2ccc(O)cc12)C(=O)N[C@@H](Cc1ccc(cc1)-c1ccccc1)C(=O)N[C@@H](CCCCNC(N)=N)C(=O)NCC(=O)Nc1ccccc1O
InChI Key
Data  1 Kd
  Tab Delimited (TSV)   2D SDfile   Computed 3D by Vconf -m prep SDfile
Find this compound or compounds like it in BindingDB:
Activity Spreadsheet -- Enzyme Inhibition Constant Data from BindingDB
Found 1 hit for monomerid = 50572058
TargetEphrin type-A receptor 4(Homo sapiens (Human))
University Of California
Curated by ChEMBL
LigandPNGBDBM50572058(CHEMBL4850403)
Affinity DataKd:  191nM. Assay description: Binding affinity to N-terminal His tagged EphA4 LBD (unknown origin) (29 to 209 residues) expressed in Rosetta-Gami B(DE3) cells by isothermal titrat...
Ligand InfoPC cidPC sid
In DepthDetails ArticlePubMed