BDBM50572062 CHEMBL4853333
SMILES N[C@H]1CCC[C@@H](C1)C(=O)N[C@@H](Cc1c[nH]c2ccc(O)cc12)C(=O)N[C@@H](Cc1ccc(cc1)-c1ccccc1)C(=O)N[C@@H](CCCCNC(N)=N)C(=O)NCC(=O)Nc1ccc(CN2CCOCC2)cc1
InChI Key
Data  2 Kd
  Tab Delimited (TSV)   2D SDfile   Computed 3D by Vconf -m prep SDfile
Find this compound or compounds like it in BindingDB:
Activity Spreadsheet -- Enzyme Inhibition Constant Data from BindingDB
Found 2 hits for monomerid = 50572062
TargetEphrin type-A receptor 3(Homo sapiens (Human))
University Of California
Curated by ChEMBL
LigandPNGBDBM50572062(CHEMBL4853333)
Affinity DataKd:  7.00E+3nM. Assay description: Binding affinity to N-terminal His tagged EphA3 LBD (unknown origin) expressed in Rosetta-Gami B(DE3) cells by isothermal titration calorimetry
Ligand InfoPC cidPC sid
In DepthDetails ArticlePubMed
TargetEphrin type-A receptor 4(Homo sapiens (Human))
University Of California
Curated by ChEMBL
LigandPNGBDBM50572062(CHEMBL4853333)
Affinity DataKd:  144nM. Assay description: Binding affinity to N-terminal His tagged EphA4 LBD (unknown origin) (29 to 209 residues) expressed in Rosetta-Gami B(DE3) cells by isothermal titrat...
Ligand InfoPC cidPC sid
In DepthDetails ArticlePubMed