BDBM50572668 CHEMBL4856543
SMILES Cn1ccc2cc(CNC(=O)N3CC(COc4ccc(cc4)C#N)C3)ccc12
InChI Key InChIKey=KQHBOKVREHRZHR-UHFFFAOYSA-N
Data  1 EC50
  Tab Delimited (TSV)   2D SDfile   Computed 3D by Vconf -m prep SDfile
Find this compound or compounds like it in BindingDB:
Activity Spreadsheet -- Enzyme Inhibition Constant Data from BindingDB
Found 1 hit for monomerid = 50572668
TargetNeuronal acetylcholine receptor subunit alpha-7(Homo sapiens (Human))
Gedeon Richter
Curated by ChEMBL
LigandPNGBDBM50572668(CHEMBL4856543)
Affinity DataEC50:  350nM. Assay description: Positive allosteric modulator activity at human alpha7 nAChR expressed in Flp-In-HEK293 cells co-expressing RIC-3 assessed as potentiation of PNU2829...
Ligand InfoPC cidPC sid
In DepthDetails ArticlePubMed