BDBM50572956 CHEMBL4855230
SMILES O=C1CCC(=O)N1OS(=O)(=O)c1ccc(cc1)-c1ccccc1
InChI Key InChIKey=MNBBOLNLMNXWFK-UHFFFAOYSA-N
Data  2 IC50
  Tab Delimited (TSV)   2D SDfile   Computed 3D by Vconf -m prep SDfile
Find this compound or compounds like it in BindingDB:
Activity Spreadsheet -- Enzyme Inhibition Constant Data from BindingDB
Found 2 hits for monomerid = 50572956
TargetPresenilins-associated rhomboid-like protein, mitochondrial(Homo sapiens)
Oberlin College
Curated by ChEMBL
LigandPNGBDBM50572956(CHEMBL4855230)
Affinity DataIC50:  1.90E+3nM. Assay description: Inhibition of human PARL transfected in HEK293T cell membrane assessed as inhibition of FP-Rh labeling treated with compound for 30 mins prior to FP-...
Ligand InfoPC cidPC sid
In DepthDetails ArticlePubMed
TargetRhomboid protease GlpG(Escherichia coli (Enterobacteria))
Oberlin College
Curated by ChEMBL
LigandPNGBDBM50572956(CHEMBL4855230)
Affinity DataIC50:  2.60E+4nM. Assay description: Inhibition of GlpG in Escherichia coli BL21 assessed as inhibition of FP-Rh labeling treated with compound for 30 mins prior to FP-Rh addition by com...
Ligand InfoPC cidPC sid
In DepthDetails ArticlePubMed