BDBM50573119 CHEMBL4850040
SMILES CN(Cc1ccc2nccn2c1)c1nnc(o1)-c1ccc(cc1)-c1ccccc1
InChI Key InChIKey=VNCYFMUTMBPAJT-UHFFFAOYSA-N
Data  3 IC50
  Tab Delimited (TSV)   2D SDfile   Computed 3D by Vconf -m prep SDfile
Find this compound or compounds like it in BindingDB:
Activity Spreadsheet -- Enzyme Inhibition Constant Data from BindingDB
Found 3 hits for monomerid = 50573119
TargetTyrosine-protein kinase Mer(Homo sapiens (Human))
Astrazeneca
Curated by ChEMBL
LigandPNGBDBM50573119(CHEMBL4850040)
Affinity DataIC50:  40nM. Assay description: Inhibition of MER (unknown origin) by LC-MS analysis
Ligand InfoPC cidPC sid
In DepthDetails ArticlePubMed
TargetReceptor-type tyrosine-protein kinase FLT3(Homo sapiens (Human))
Astrazeneca
Curated by ChEMBL
LigandPNGBDBM50573119(CHEMBL4850040)
Affinity DataIC50:  2.51E+4nM. Assay description: Inhibition of FLT3 (unknown origin) by LC-MS analysis
Ligand InfoPC cidPC sid
In DepthDetails ArticlePubMed
TargetTyrosine-protein kinase receptor UFO(Homo sapiens (Human))
Astrazeneca
Curated by ChEMBL
LigandPNGBDBM50573119(CHEMBL4850040)
Affinity DataIC50:  3.16E+3nM. Assay description: Inhibition of AXL (unknown origin) by LC-MS analysis
Ligand InfoPC cidPC sid
In DepthDetails ArticlePubMed