BDBM50573202 CHEMBL4877696
SMILES CCn1ncc(Nc2ccc(CN)cc2)c(Cl)c1=O
InChI Key InChIKey=LYMIUODDCXRSOF-UHFFFAOYSA-N
Data  2 IC50
  Tab Delimited (TSV)   2D SDfile   Computed 3D by Vconf -m prep SDfile
Find this compound or compounds like it in BindingDB:
Activity Spreadsheet -- Enzyme Inhibition Constant Data from BindingDB
Found 2 hits for monomerid = 50573202
TargetBromodomain-containing protein 4(Homo sapiens (Human))
University Of Minnesota
Curated by ChEMBL
LigandPNGBDBM50573202(CHEMBL4877696)
Affinity DataIC50:  3.50E+4nM. Assay description: Inhibition of HIS9-tagged BRD4 (unknown origin) expressed in Escherichia coli BL21 (DE3) cells incubated for 30 mins by AlphaScreen assay
Ligand InfoPC cidPC sid
In DepthDetails ArticlePubMed
TargetNucleosome-remodeling factor subunit BPTF(Homo sapiens (Human))
University Of Minnesota
Curated by ChEMBL
LigandPNGBDBM50573202(CHEMBL4877696)
Affinity DataIC50:  550nM. Assay description: Inhibition of HIS9-tagged BPTF (unknown origin) expressed in Escherichia coli BL21 (DE3) cells incubated for 30 mins by AlphaScreen assay
Ligand InfoPC cidPC sid
In DepthDetails ArticlePubMed