BDBM50573991 CHEMBL4852965
SMILES Clc1ccc(C(=O)Nc2ccc(cc2)S(=O)(=O)Nc2ccccc2)c(Cl)c1
InChI Key InChIKey=LNUTUGZHBGDTOU-UHFFFAOYSA-N
Data  2 EC50
  Tab Delimited (TSV)   2D SDfile   Computed 3D by Vconf -m prep SDfile
Find this compound or compounds like it in BindingDB:
Activity Spreadsheet -- Enzyme Inhibition Constant Data from BindingDB
Found 2 hits for monomerid = 50573991
TargetProbable G-protein coupled receptor 27(Homo sapiens)
University Of Bonn
Curated by ChEMBL
LigandPNGBDBM50573991(CHEMBL4852965)
Affinity DataEC50:  912nM. Assay description: Agonist activity at human GPR27 expressed in HEK293 cells assessed as induction of beta-arrestin recruitment pretreated with substrate for 45 mins fo...
Ligand InfoPC cidPC sid
In DepthDetails ArticlePubMed
TargetProbable G-protein coupled receptor 27(Homo sapiens)
University Of Bonn
Curated by ChEMBL
LigandPNGBDBM50573991(CHEMBL4852965)
Affinity DataEC50:  457nM. Assay description: Agonist activity at human GPR27 expressed in HEK293 cells co-expressing FnLArrb2.GPR27V2LFc assessed as induction of beta-arrestin recruitment incuba...
Ligand InfoPC cidPC sid
In DepthDetails ArticlePubMed