BDBM50574012 CHEMBL4860248
SMILES Fc1cc(I)ccc1C(=O)Nc1ccc(cc1)S(=O)(=O)Nc1ccccc1
InChI Key InChIKey=FEETWFGNHVHRAS-UHFFFAOYSA-N
Data  1 EC50
  Tab Delimited (TSV)   2D SDfile   Computed 3D by Vconf -m prep SDfile
Find this compound or compounds like it in BindingDB:
Activity Spreadsheet -- Enzyme Inhibition Constant Data from BindingDB
Found 1 hit for monomerid = 50574012
TargetProbable G-protein coupled receptor 27(Homo sapiens)
University Of Bonn
Curated by ChEMBL
LigandPNGBDBM50574012(CHEMBL4860248)
Affinity DataEC50:  5.13E+3nM. Assay description: Agonist activity at human GPR27 expressed in HEK293 cells co-expressing FnLArrb2.GPR27V2LFc assessed as induction of beta-arrestin recruitment incuba...
Ligand InfoPC cidPC sid
In DepthDetails ArticlePubMed