BDBM50574013 CHEMBL4861825
SMILES Fc1cc(ccc1C(=O)Nc1ccc(cc1)S(=O)(=O)Nc1ccccc1)C#N
InChI Key InChIKey=AFGAZJNDWLABNV-UHFFFAOYSA-N
Data  1 EC50
  Tab Delimited (TSV)   2D SDfile   Computed 3D by Vconf -m prep SDfile
Find this compound or compounds like it in BindingDB:
Activity Spreadsheet -- Enzyme Inhibition Constant Data from BindingDB
Found 1 hit for monomerid = 50574013
TargetProbable G-protein coupled receptor 27(Homo sapiens)
University Of Bonn
Curated by ChEMBL
LigandPNGBDBM50574013(CHEMBL4861825)
Affinity DataEC50:  229nM. Assay description: Agonist activity at human GPR27 expressed in HEK293 cells co-expressing FnLArrb2.GPR27V2LFc assessed as induction of beta-arrestin recruitment incuba...
Ligand InfoPC cidPC sid
In DepthDetails ArticlePubMed