BDBM50574016 CHEMBL4872926
SMILES Clc1cnc(C(=O)Nc2ccc(cc2)S(=O)(=O)Nc2ccccc2)c(Cl)c1
InChI Key InChIKey=ZYXZKBVCSSVYAA-UHFFFAOYSA-N
Data  1 EC50
  Tab Delimited (TSV)   2D SDfile   Computed 3D by Vconf -m prep SDfile
Find this compound or compounds like it in BindingDB:
Activity Spreadsheet -- Enzyme Inhibition Constant Data from BindingDB
Found 1 hit for monomerid = 50574016
TargetProbable G-protein coupled receptor 27(Homo sapiens)
University Of Bonn
Curated by ChEMBL
LigandPNGBDBM50574016(CHEMBL4872926)
Affinity DataEC50:  5.75E+3nM. Assay description: Agonist activity at human GPR27 expressed in HEK293 cells co-expressing FnLArrb2.GPR27V2LFc assessed as induction of beta-arrestin recruitment incuba...
Ligand InfoPC cidPC sid
In DepthDetails ArticlePubMed