BDBM50575504 CHEMBL4867456
SMILES CCCCC(=O)CCc1ccc(O)c(O)c1
InChI Key InChIKey=AGQLEGXILUJZKM-UHFFFAOYSA-N
Data  1 IC50
  Tab Delimited (TSV)   2D SDfile   Computed 3D by Vconf -m prep SDfile
Find this compound or compounds like it in BindingDB:
Activity Spreadsheet -- Enzyme Inhibition Constant Data from BindingDB
Found 1 hit for monomerid = 50575504
TargetIslet amyloid polypeptide(Homo sapiens)
Taipei Medical University
Curated by ChEMBL
LigandPNGBDBM50575504(CHEMBL4867456)
Affinity DataIC50:  3.50E+3nM. Assay description: Inhibition of islet amyloid polypeptide (unknown origin) aggregation after 24 hrs by thioflavin T based fluorescence assay
Ligand InfoPC cidPC sid
In DepthDetails ArticlePubMed