BDBM50575506 CHEMBL4876866
SMILES CCC(=O)CCc1cccc(O)c1O
InChI Key InChIKey=BKYVHNITKPAYEC-UHFFFAOYSA-N
Data  1 IC50
  Tab Delimited (TSV)   2D SDfile   Computed 3D by Vconf -m prep SDfile
Find this compound or compounds like it in BindingDB:
Activity Spreadsheet -- Enzyme Inhibition Constant Data from BindingDB
Found 1 hit for monomerid = 50575506
TargetIslet amyloid polypeptide(Homo sapiens)
Taipei Medical University
Curated by ChEMBL
LigandPNGBDBM50575506(CHEMBL4876866)
Affinity DataIC50:  3.90E+3nM. Assay description: Inhibition of islet amyloid polypeptide (unknown origin) aggregation after 24 hrs by thioflavin T based fluorescence assay
Ligand InfoPC cidPC sid
In DepthDetails ArticlePubMed