BDBM50575509 CHEMBL4876955
SMILES Oc1ccc(\C=C\C(=O)CCCCc2ccccc2O)cc1O
InChI Key InChIKey=KJSJBXTXRKFSBV-PKNBQFBNSA-N
Data  1 IC50
  Tab Delimited (TSV)   2D SDfile   Computed 3D by Vconf -m prep SDfile
Find this compound or compounds like it in BindingDB:
Activity Spreadsheet -- Enzyme Inhibition Constant Data from BindingDB
Found 1 hit for monomerid = 50575509
TargetIslet amyloid polypeptide(Homo sapiens)
Taipei Medical University
Curated by ChEMBL
LigandPNGBDBM50575509(CHEMBL4876955)
Affinity DataIC50:  1.20E+3nM. Assay description: Inhibition of islet amyloid polypeptide (unknown origin) aggregation after 24 hrs by thioflavin T based fluorescence assay
Ligand InfoPC cidPC sid
In DepthDetails ArticlePubMed