BDBM50576000 CHEMBL4587880
SMILES Cc1[nH]c2c(c(nn2c(=O)c1-c1ccc(O)cc1)-c1ccccc1)-c1ccccc1
InChI Key InChIKey=XIBPFOOTGIAJOB-UHFFFAOYSA-N
Data  1 IC50
  Tab Delimited (TSV)   2D SDfile   Computed 3D by Vconf -m prep SDfile
Find this compound or compounds like it in BindingDB:
Activity Spreadsheet -- Enzyme Inhibition Constant Data from BindingDB
Found 1 hit for monomerid = 50576000
TargetS-adenosylmethionine synthase isoform type-2(Human)
Agios Pharmaceuticals
Curated by ChEMBL
LigandPNGBDBM50576000(CHEMBL4587880)
Affinity DataIC50:  33nM. Assay description: Inhibition of recombinant human MAT2A expressed in baculovirus infected Sf9 cells assessed as S-adenosyl methionine production using L-methionine as ...
Ligand InfoPC cidPC sid
In DepthDetails ArticlePubMed