BDBM50576016 CHEMBL4584451
SMILES CCOC(=O)n1ccc(Nc2[nH]c3c(c(nn3c(=O)c2-c2ccc(OC)cc2)-c2ccccc2)-c2ccccc2)n1
InChI Key InChIKey=JVLMKJFTVYMJIA-UHFFFAOYSA-N
Data  1 IC50
  Tab Delimited (TSV)   2D SDfile   Computed 3D by Vconf -m prep SDfile
Find this compound or compounds like it in BindingDB:
Activity Spreadsheet -- Enzyme Inhibition Constant Data from BindingDB
Found 1 hit for monomerid = 50576016
TargetS-adenosylmethionine synthase isoform type-2(Human)
Agios Pharmaceuticals
Curated by ChEMBL
LigandPNGBDBM50576016(CHEMBL4584451)
Affinity DataIC50:  11nM. Assay description: Inhibition of recombinant human MAT2A expressed in baculovirus infected Sf9 cells assessed as S-adenosyl methionine production using L-methionine as ...
Ligand InfoPC cidPC sid
In DepthDetails ArticlePubMed