BDBM50576019 CHEMBL4568226
SMILES COc1ccc(cc1)-c1c(Nc2ccccn2)[nH]c2c(c(nn2c1=O)-c1ccccc1)-c1ccccc1
InChI Key InChIKey=QWJFOXJMIHKFKS-UHFFFAOYSA-N
Data  1 IC50
  Tab Delimited (TSV)   2D SDfile   Computed 3D by Vconf -m prep SDfile
Find this compound or compounds like it in BindingDB:
Activity Spreadsheet -- Enzyme Inhibition Constant Data from BindingDB
Found 1 hit for monomerid = 50576019
TargetS-adenosylmethionine synthase isoform type-2(Human)
Agios Pharmaceuticals
Curated by ChEMBL
LigandPNGBDBM50576019(CHEMBL4568226)
Affinity DataIC50:  7nM. Assay description: Inhibition of recombinant human MAT2A expressed in baculovirus infected Sf9 cells assessed as S-adenosyl methionine production using L-methionine as ...
Ligand InfoPC cidPC sid
In DepthDetails ArticlePubMed