BDBM50576225 CHEMBL4879274
SMILES CCN(CC#C)c1ccc2c(C)cc(=O)oc2c1
InChI Key InChIKey=LOPGOJVICYUEAA-UHFFFAOYSA-N
Data  1 EC50
  Tab Delimited (TSV)   2D SDfile   Computed 3D by Vconf -m prep SDfile
Find this compound or compounds like it in BindingDB:
Activity Spreadsheet -- Enzyme Inhibition Constant Data from BindingDB
Found 1 hit for monomerid = 50576225
TargetImmunoglobulin lambda variable 6-57(Homo sapiens)
The Scripps Research Institute
Curated by ChEMBL
LigandPNGBDBM50576225(CHEMBL4879274)
Affinity DataEC50:  2.65E+3nM. Assay description: Stabilization of AL patient derived full length fluorescein-labeled IGLV6-57 expressed in Escherichia coli BL21 (DE3) measured after 24 hrs by proteo...
Ligand InfoPC cidPC sid
In DepthDetails ArticlePubMed