BDBM50577055 CHEMBL4852852
SMILES FC(F)(F)c1ccc(cc1)C(=O)NNC1C2CC3CC1CC(Cl)(C3)C2
InChI Key InChIKey=SIULYFIPBJFTAV-UHFFFAOYSA-N
Data  1 IC50
  Tab Delimited (TSV)   2D SDfile   Computed 3D by Vconf -m prep SDfile
Find this compound or compounds like it in BindingDB:
Activity Spreadsheet -- Enzyme Inhibition Constant Data from BindingDB
Found 1 hit for monomerid = 50577055
TargetEnvelope phospholipase F13(Vaccinia virus (strain Western Reserve) (VACV) (Va...)
Samara State Technical University
Curated by ChEMBL
LigandPNGBDBM50577055(CHEMBL4852852)
Affinity DataIC50:  3.52E+3nM. Assay description: Inhibition of p37 in Vaccinia virus Copenhagen infected in African green monkey Vero cells assessed as reduction in viral reproduction incubated for ...
Ligand InfoPC cidPC sid
In DepthDetails ArticlePubMed