BDBM50578123 CHEMBL4872591
SMILES Cc1ccc2[nH]c(nc2c1)-c1cncc(-c2cc(C)cc(C)c2)c1N1CCC(N)CC1
InChI Key InChIKey=HJIZPSICVCGBRT-UHFFFAOYSA-N
Data  1 IC50  1 EC50
  Tab Delimited (TSV)   2D SDfile   Computed 3D by Vconf -m prep SDfile
Find this compound or compounds like it in BindingDB:
Activity Spreadsheet -- Enzyme Inhibition Constant Data from BindingDB
Found 2 hits for monomerid = 50578123
TargetPotassium voltage-gated channel subfamily H member 2(Homo sapiens (Human))
Ono Pharmaceutical
Curated by ChEMBL
LigandPNGBDBM50578123(CHEMBL4872591)
Affinity DataIC50:  1.00E+3nM. Assay description: Inhibition of human ERG expressed in CHO-K1 cells with holding potential -80 mV incubated for 5 mins by patch-clamp assay
Ligand InfoPC cidPC sid
In DepthDetails ArticlePubMed
TargetSomatostatin receptor type 2(Homo sapiens (Human))
Ono Pharmaceutical
Curated by ChEMBL
LigandPNGBDBM50578123(CHEMBL4872591)
Affinity DataEC50:  0.0130nM. Assay description: Agonist activity at human SSTR2 expressed in CHO-K1 cells assessed as inhibition of forskolin-induced cAMP accumulation measured after 30 mins by Glo...
Ligand InfoPC cidPC sid
In DepthDetails ArticlePubMed