BDBM50578194 CHEMBL4849349
SMILES Nc1cc(Oc2ccc(NC(=O)Nc3cccc(c3)C(F)(F)F)cc2)ncn1
InChI Key InChIKey=AVKRLFMBOPHBOL-UHFFFAOYSA-N
Data  5 IC50
  Tab Delimited (TSV)   2D SDfile   Computed 3D by Vconf -m prep SDfile
Find this compound or compounds like it in BindingDB:
Activity Spreadsheet -- Enzyme Inhibition Constant Data from BindingDB
Found 5 hits for monomerid = 50578194
TargetSerine/threonine-protein kinase TNNI3K(Homo sapiens (Human))
Glaxosmithkline
Curated by ChEMBL
LigandPNGBDBM50578194(CHEMBL4849349)
Affinity DataIC50:  25nM. Assay description: Inhibition of TNNI3K (unknown origin)
Ligand InfoPC cidPC sid
In DepthDetails ArticlePubMed
TargetSerine/threonine-protein kinase TNNI3K(Homo sapiens (Human))
Glaxosmithkline
Curated by ChEMBL
LigandPNGBDBM50578194(CHEMBL4849349)
Affinity DataIC50:  16nM. Assay description: Inhibition of human myc-TNNI3K expressed in HEK-MSR2 cells assessed as reduction in TNNI3K autophosphorylation preincubated for 30 mins followed by p...
Ligand InfoPC cidPC sid
In DepthDetails ArticlePubMed
TargetSerine/threonine-protein kinase B-raf(Homo sapiens (Human))
Glaxosmithkline
Curated by ChEMBL
LigandPNGBDBM50578194(CHEMBL4849349)
Affinity DataIC50:  1.60E+3nM. Assay description: Inhibition of B-Raf (unknown origin)
Ligand InfoPC cidPC sid
In DepthDetails ArticlePubMed
TargetMitogen-activated protein kinase 14(Homo sapiens (Human))
Glaxosmithkline
Curated by ChEMBL
LigandPNGBDBM50578194(CHEMBL4849349)
Affinity DataIC50:  1.00E+3nM. Assay description: Inhibition of p38alpha (unknown origin)
Ligand InfoPC cidPC sid
In DepthDetails ArticlePubMed
TargetVascular endothelial growth factor receptor 2(Homo sapiens (Human))
Glaxosmithkline
Curated by ChEMBL
LigandPNGBDBM50578194(CHEMBL4849349)
Affinity DataIC50:  7.90nM. Assay description: Inhibition of GST-6His tagged VEGFR2 (unknown origin) using biotin-aminohexyl-EEEEYFELVAKKKK-NH2 peptide substrate incubated for 90 mins by HTRF assa...
Ligand InfoPC cidPC sid
In DepthDetails ArticlePubMed